{"text_format":"1","workbook":"xlsx","n_sheets":9,"sheets":["About TaPL3","Instructions","Chemical Properties","Environmental Properties","Emissions","Results","Diagram","Chemical Database","Environmental Database"],"not_rendered":{"charts":0,"images":10,"macros":1,"external_links":1,"defined_names":184,"comments":6,"pivot_tables":0},"unopened":[],"bounds":{"document_bytes":16777216,"sheet_cells":100000,"rows_first":2000,"rows_last":500,"rows_between":2000,"halvings":0,"cell_chars":16384,"cell_head_chars":4096},"cells_cut":0,"cells_raw":0,"read":"whole","date_system":"1900"}

{"sheet":"About TaPL3","index":0,"n_rows":22,"n_cols":6,"rows_kept":22,"cut":false,"hidden":false,"merged":[[16,3,17,3],[6,3,8,3],[6,2,7,2],[9,2,10,2],[9,3,11,3],[12,3,15,3]]}
[]
[null,"TaPL3 Spreadsheet Model"]
[]
[null,"There are three key results in the TaPL3 model that distinguish it from EQC: CTD, P, and H"]
[]
[null,"Parameter Symbol","Parameter Name","Parameter Description","Calculation","Variable Definitions"]
[null,"CTD_air","Characterstic Travel Distance in air","Describes the potential for long-range transport in air (km). This value should be compared to a reference chemical for results to be meaningful","CTD_air = U_wind * t_air * Y_air","U_wind = wind velocity (km/h)"]
[null,null,null,null,null,"t_air = half-life in air (h)"]
[null,null,null,null,null,"Y_air = mass fraction of chemical in air"]
[null,"CTD_water","Characterstic Travel Distance in water","Describes the potential for long-range transport in water (km). This value should be compared to a reference chemical for results to be meaningful","CTD_water = U_water * t_water * Y_water","U_water = water velocity (km/h)"]
[null,null,null,null,null,"t_water = half-life in water (h)"]
[null,null,null,null,null,"Y_water = mass fraction of chemical in water"]
[null,"P","Overall persistence","First estimate of overall environmental persistence. Useful particularly for showing the which loss porcesses are likely to be most important. Note: A short half-life may not be significant if relatively little of the chemical is subject to degradation by virtue of its partitioning","P = M / E","M = Total quantity of chemical in the system (mol)"]
[null,null,null,null,null,"E = emission rate (mol/h)"]
[]
[]
[null,"H","Hopping","Average number of Hops experienced by the chemical. It is calculated only for emission to air","H = (N_w,a + N_s,a + N_v,a) / E_a","N_w,a = transfer rate from water to air (mol/h)"]
[null,null,null,null,null,"N_s,a = transfer rate from soil to air (mol/h)"]
[null,null,null,null,null,"N_v,a = transfer rate from vegetation to air (mol/h)"]
[null,null,null,null,null,"E_a = emission rate to air (mol/h)"]
{"$rows_left_out":3}
{"sheet":"Instructions","index":1,"n_rows":25,"n_cols":3,"rows_kept":25,"cut":false,"hidden":false,"merged":[[0,1,1,23],[7,2,7,23],[8,1,8,23],[10,1,10,23]]}
[null,"The TaPL3 model uses different input properties depending on whether they are Type 1, Type 2, or Type 3 chemicals (as defined in Mackay et al. 1996). In this version of the model, the chemical 'Type' is selected based on certain chemical properties, rather than by user selection. Selection rules are as follows:"]
[]
[null,"Type 1 chemicals: Substances partition into air, water and octanol. These chemicals have measurable vapour pressures and solubilities. If a vapour pressure value is entered the chemical will be treated as Type 1."]
[null,null,"If the vapour pressure is not meaurable or negligible, enter a dash in vapour pressure cell, then continue to fill out the rest of the properties"]
[null,"Type 2 chemicals: The substance does not appreciably partition into air. If a dash is entered into vapour pressure then additional partition ratio inputs will appear for media/water systems"]
[null,"Type 3 chemicals: The substance does not appreciably partition into water. If a dash is entered in the vapour pressure input and the soil/water partition ratio value is 1000 or larger, then the required inputs will be media/air"]
[null,null,"If the inputted soil/water partition ratio > 1000, ALL partition ratio inputs will change to media/air from media/water. Some values may need to be re-inputted as media/air instead of media/water"]
[null,"Notes:","After the Inputs for your chemical is filled out in the Inputs sheet, it is recommended to add the chemical to the database by clicking the radial button 'Add to DB' to easily-re-enter the correct input data in the future\nSample Type 1, 2, and 3 chemicals can be found in the chemical database"]
[null,"Continue filling out any remaining chemical properties, environmental properties, and emission data. Default emission is to air, but can be switched to water.\nResults can be found in the corresponding 'Results' sheets and are summarized in the 'Diagram' sheets"]
[]
[null,"Property estimation guidelines (all equations from Mackay & Parnis 2021):"]
[null,"- Henry's law constant (H) an be estimated as: Vapor Pressure * Molar Mass / Solubility"]
[null,"- Reaction half-life estimated values can be obtained from EAS-E Suite (www.eas-e-suite.com), or EPI Suite for water & air half-lives only (https://www.epa.gov/tsca-screening-tools/epi-suitetm-estimation-program-interface)"]
[null,"- Koc can be estimated as Kow * 0.35 (Seth method) or as Kow * 0.41 (Karickhoff method)"]
[null,"- Kaw can be calculated as H/RT, where R = Gas constant and T = temperature"]
[null,"- Partition ratios can be calculated as the ratio of Z-values, e.g., Kaw = Za/Zw"]
[null,null,"> Za = 1/RT = 4x10^-4"]
[null,null,"> Zw = Za/Kaw"]
[null,null,"> Zo = Zw*Kow"]
[null,null,"> Z_solid = Zo * OC fraction; where any solid phase can be represented including sediment, suspended sediment, soil, etc. OC fraction default values can be found in the Environment properties sheet"]
{"$rows_left_out":6}
{"sheet":"Chemical Properties","index":2,"n_rows":48,"n_cols":11,"rows_kept":48,"cut":false,"hidden":false,"merged":[]}
[]
[]
[null,null,"CHEMICAL PROPERTIES","Please complete all required fields below"]
[null,null,null,"or"]
[null,null,null,"Select a chemical from the database:"]
[null,null,"* indicates required input"]
[null,null,"Note: insert dash (-) if property is not inputted"]
[null,null,null,null,"Name in spreadsheet",null,null,"Calculated Chemical Parameters",null,null,"Name in spreadsheet"]
[null,"*","Chemical Name","Specimen Type 3","ChemName",null,null,"Kow corrected for regional temperature",{"$f":"IF(ISNUMBER(LKOW),(10^LKOW)*EXP(D47*1000/I15*(1/I13-1/I14)),\"-\")","v":"-"},null,"KowE"]
[null,null,"CAS",null,null,null,null,"Fish-water partition ratio",{"$f":"IF(ISNUMBER(LKOW),I9*'Environmental Properties'!H28,Part6_2)","v":{"$error":"#N/A"}},null,"KFW"]
[null,null,null,null,null,null,null,"For solids, estimated subcooled liquid vapour pressure",{"$f":"IF(ISNUMBER(Pressure),Pressure/Fug_Ratio,\"-\")","v":"-"},null,"PL"]
[null,"*","Molar Mass (g/mol)",180,"MolMass",null,null,"Kaw corrected for regional temperature",{"$f":"_xlfn.IFS(TYPE=\"One\",(HenLw/I16)*EXP(D48*1000/8.314*(1/I13-1/I14)),TYPE=\"Two\",Part1_2,TYPE=\"Three\",1/D39)","v":1.6666666666666666E-2},null,"KawE"]
[null,"*","Data Temperature (°C)",21,"DataTemp",null,null,"Data temperature K",{"$f":"DataTemp+273.15","v":294.14999999999998},null,"DataTempK"]
[null,null,"Melting Point (°C)",null,"MeltPt",null,null,"Environmental temperature K",{"$f":"'Environmental Properties'!D9+273.15","v":293.14999999999998},null,"EnvTempK"]
[null,null,"Vapor Pressure (Pa)","-","Pressure",null,null,"Gas constant",8.3140000000000001,null,"Gas_Constant"]
[null,null,"Water solubility (g/m3)",null,null,null,null,"RT",{"$f":"I15*I13","v":2445.5630999999998},null,"RT"]
[null,{"$f":"IF(Pressure=\"-\",\"\",\"*\")","v":""},"Henry's Law Constant (Pa·m³/mol)","-","HenLw"]
[null,null,"Chemical Type:",{"$f":"IF(AND(ISNUMBER(SEARCH(\"-\",Pressure)),KQW<1000),\"Two\",IF(ISNUMBER(SEARCH(\"-\",Pressure)),\"Three\",\"One\"))","v":"Three"},"TYPE"]
[null,null,null,null,null,null,null,"Calculated Partition ratios - dimensionless"]
[null,null,"Reaction Half-Lives (hours)","For half-lives if negligible enter 1E11",null,null,null,"Gaseous air/Water",{"$f":"_xlfn.IFS(TYPE=\"One\",Z_AirVapour*HenLw,TYPE=\"Two\",D39,TYPE=\"Three\",1/D39)","v":1.6666666666666666E-2},"   1 = Air","Part1_2"]
{"$rows_left_out":29}
{"sheet":"Environmental Properties","index":3,"n_rows":53,"n_cols":13,"rows_kept":53,"cut":false,"hidden":false,"merged":[]}
[]
[]
[null,null,"Environmental Properties"]
[]
[null,null,"Please complete all fields or select an environment from the database:"]
[]
[null,null,null,null,"Name in spreadsheet"]
[null,null,"Environment Name","EQC- standard environment","EnvName"]
[null,null,"Environment Temperature (°C)",20,"EnvTemp",null,"Densities (kg/m3)",null,"Name in spreadsheet",null,"Transport Velocities (m/h)",null,"Name in spreadsheet"]
[null,null,null,null,null,null,"Air in Air",1.1850000000000001,null,null,"Air-side air-water MTC",5,"MTC_airside_AirWater"]
[null,null,"Volume Fractions",null,null,null,"Aerosol in Air",2000,null,null,"Water-side air-water MTC",0.05,"MTC_waterside_AirWater"]
[null,null,"Aerosol in Air",1.9999999999999999E-11,"vf_Q",null,"Water in Water",1000,null,null,"Rain rate",1E-4,"Rain_rate"]
[null,null,"Susp. Particles in Water ",5.0000000000000004E-6,"vf_sus_water",null,"Sup. Particles in Water",1500,null,null,"Aerosol dry deposition",10,"Aer_Dry_Dep"]
[null,null,"Fish in Water",9.9999999999999995E-7,"vf_fish_water",null,"Fish in Water",1000,null,null,"Soil-air phase diffusion MTC",0.02,"MTC_diff_SoilAir"]
[null,null,"Air in Soil",0.2,"vf_air_soil",null,"Air in Soil",1.1850000000000001,null,null,"Soil-water phase diffusion MTC",1.0000000000000001E-5,"MTC_diff_SoilWater"]
[null,null,"Water in Soil",0.3,"vf_water_soil",null,"Water in Soil",1000,null,null,"Soil-air boundary layer MTC",5,"MTC_boundary_SoilAir"]
[null,null,"Solids in Soil",0.5,"vf_solids_soil",null,"Solid in Soil",2400,null,null,"Water-side sed.-water diffusion MTC",1E-4,"MTC_waterside_SedWater"]
[null,null,"Water in Sediment",0.8,"vf_water_sed",null,"Water in Sediment",1000,null,null,"Sediment deposition",4.9999999999999998E-7,"Sed_Dep"]
[null,null,"Solids in Sediment",0.2,"vf_soil_sed",null,"Solid in Sediment",2400,null,null,"Sediment resuspension",1.9999999999999999E-7,"Sed_Resusp"]
[null,null,null,null,null,null,"Vegetation",900,null,null,"Soil-water runoff rate",5.0000000000000002E-5,"Rate_Soil_Water"]
{"$rows_left_out":34}
{"sheet":"Emissions","index":4,"n_rows":6,"n_cols":5,"rows_kept":6,"cut":false,"hidden":false,"merged":[]}
[]
[null,null,"Emission Rate"]
[null,null,"Select whether emission is to air or water:"]
[]
[null,null,"Into Air",1000,"kg/h"]
[null,null,"Into Water",0,"kg/h"]

{"sheet":"Results","index":5,"n_rows":104,"n_cols":14,"rows_kept":104,"cut":false,"hidden":false,"merged":[[100,5,100,6],[101,5,101,6],[103,5,103,6],[95,5,95,6],[28,4,28,6],[96,5,96,6],[97,5,97,6],[99,5,99,6],[28,7,28,9],[51,3,51,4],[51,7,51,8],[72,3,72,4],[72,7,72,8]]}
[]
[null,null,"Chemical:",{"$f":"'Chemical Properties'!D9","v":"Specimen Type 3"},null,null,"Name of Environment",{"$f":"EnvName","v":"EQC- standard environment"}]
[]
[null,null,"Summary",null,null,null,null,null,null,null,null,null,"Advective residence times (h)"]
[null,null,{"$f":"IF(EmissRate_Water=0,\"Long-Range Transport in Air (km)\",\"Long-Range Transport in River Water (km)\")","v":"Long-Range Transport in Air (km)"},null,null,null,"Overall Persistence:",{"$f":"ChemAmtM/(OutLossTotalM+0.0000001)","v":101.04866274503142},"Hours",null,null,null,"Air",{"$f":"IF(Wind_velocity=0,\"Negligible\",Area_air^0.5/Wind_velocity)","v":21960.261528947078}]
[null,null,"Overall",{"$f":"IF(EmissRate_Water=0,IF(ChemAmtM<0.00000000001,100000000000,Wind_velocity*AmtMolBulk_Air*Overall_Persistence/ChemAmtM),IF(ChemAmtM=0,0,Water_Velocity*AmtMolBulk_Water*Overall_Persistence/ChemAmtM))","v":1134.1091617477662},null,null,null,{"$f":"Overall_Persistence/24","v":4.2103609477096429},"Days",null,null,null,"Water",{"$f":"IF(Water_Velocity=0,\"Negligible\",Area_water^0.5/Water_Velocity)","v":27777.777777777777}]
[null,null,{"$f":"IF(EmissRate_Water=0,\"Over Water\",\"\")","v":"Over Water"},{"$f":"IF(EmissRate_Water=0,IF(I59<0.00000000001,100000000000,Wind_velocity/(Results!F56+(D_AirWater/(VZ_Air*(Area_water/Area_air)))*Results!D13)),\"\")","v":1352.8404176204479}]
[null,null,{"$f":"IF(EmissRate_Water=0,\"Over land\",\"\")","v":"Over land"},{"$f":"IF(EmissRate_Water=0,IF(I40<0.00000000001,100000000000,Wind_velocity/(Results!F56+(D_AirSoil/(VZ_Air*(Area_soil/Area_air)))*Results!D14)),\"\")","v":1140.2899108175307},null,null,"Average # of Hops",{"$f":"IF(EmissRate_Air=0,\"-\",(TransRateM_WaterAir+TransRateM_SoilAir+TransRateM_VegAir)/(EmissRate_Air*1000/MolMass))","v":0.53220044337847927},null,null,null,null,"Vegeatation Cuticle MTC",{"$f":"K99","v":5.8036217113612166E-3}]
[]
[null,null,null,null,null,null,"Emission"]
[null,null,{"$f":"IF(EmissRate_Water=0,\"Stickiness wrt Air\",\"Stickiness wrt Water\")","v":"Stickiness wrt Air"},null,null,null,"Total Chemical Input",{"$f":"SUM(Emissions!D5:D6)","v":1000},"kg/h",{"$f":"H11*1000/MolMass","v":5555.5555555555557},"mol/h"]
[null,null,"Air",{"$f":"IF(EmissRate_Water=0,\"-\",IF(TransRateM_WaterAir>0,(TransRateM_WaterAir-TransRateM_AirWater)/TransRateM_WaterAir,100000000000))","v":"-"}]
[null,null,"Water",{"$f":"IF(EmissRate_Water=0,IF(TransRateM_AirWater<0.00000000001,100000000000,(TransRateM_AirWater-TransRateM_WaterAir)/TransRateM_AirWater),\"-\")","v":-1.0411497535694989},null,null,"Total of VZ Products",{"$f":"SUM(VZ_Air:E24)","v":64676857447.677391},"mol/Pa"]
[null,null,"Soil",{"$f":"IF(EmissRate_Water=0,IF(TransRateM_AirSoil<0.00000000001,100000000000,(TransRateM_AirSoil-TransRateM_SoilAir)/TransRateM_AirSoil),\"-\")","v":0.96883504137215692},null,null,"Total amount of chemical in system",{"$f":"SUM(I31,I35,I40,I45,I49)","v":49534.858943198131},"kg",{"$f":"H14/MolMass*1000","v":275193.66079554515},"mol"]
[null,null,"Vegetation",{"$f":"IF(EmissRate_Water=0,IF(TransRateM_AirVeg<0.00000000001,100000000000,(TransRateM_AirVeg-TransRateM_VegAir)/TransRateM_AirVeg),\"-\")","v":5.3076292769293869E-3}]
[null,null,"Sediment",{"$f":"IF(EmissRate_Water=0,\"-\",IF(TransRateM_WaterSed<0.00000000001,100000000000,(Results!I79-Results!I82)/Results!I79))","v":"-"}]
[]
[null,null,{"$f":"IF(TYPE=\"Two\",\"Aquivalence\",\"Fugacity\")","v":"Fugacity"}]
[null,null,null,{"$f":"IF(TYPE=\"Two\",\"Aquivalence (m3/h)\",\"Fugacity (Pa)\")","v":"Fugacity (Pa)"},"VZ (mol/Pa)",null,"D Total and J values (for fugacity calculation)"]
[null,null,"Air",{"$f":"IF(D_Total_Water=0,(D_Total_Soil*EmissRate_Air*1000/MolMass)/((D_Total_Air*D_Total_Soil)-(D_AirSoil*D_SoilAir)),(K20+f_Water*K21)/K22)","v":5.2454054106768392E-6},{"$f":"Z_air*V_air","v":40890381441.394829},null,"D_Total_Air",{"$f":"G55+SUM(D_AirWater:D_AirVeg)","v":1074857860.9822433},null,"jTempFug(1), Pa",{"$f":"EmissRate_Air*1000/MolMass/D_Total_Air","v":5.1686420662902272E-6}]
{"$rows_left_out":85}
{"sheet":"Diagram","index":6,"n_rows":41,"n_cols":12,"rows_kept":41,"cut":false,"hidden":false,"merged":[[38,10,38,11],[4,0,5,0],[11,0,12,1],[18,6,18,7],[27,10,27,11],[32,7,32,8],[32,9,32,10]]}
[]
[null,null,null,"Chemical Name:",null,{"$f":"Results!D2","v":"Specimen Type 3"}]
[]
[null,null,null,"Lake Name:",null,{"$f":"EnvName","v":"EQC- standard environment"}]
[{"$f":"IF(B21=\"-\",\"Average Wind Speed\",\"Average River Current\")","v":"Average Wind Speed"},null,null,null,null,null,null,null,{"$f":"C21","v":1000}]
[null,{"$f":"IF(B21=\"-\",Wind_velocity,Water_Velocity)","v":14.4},"km/h"]
["Long-range transport",{"$f":"Results!D6","v":1134.1091617477662},"km"]
["Persistence",{"$f":"Results!H5","v":101.04866274503142},"h",null,null,null,{"$f":"Results!H77","v":520.10924729978649},null,null,null,{"$f":"Results!H55","v":486.55898674608932}]
["Total Mass",{"$f":"Results!H14","v":49534.858943198131},"kg"]
[{"$f":"IF(B21=\"-\",\"Average # Hopes\",\"\")","v":"Average # Hopes"},{"$f":"IF(B21=\"-\",Results!H8,\"\")","v":0.53220044337847927},null,null,null,null,null,null,{"$f":"Results!I31","v":38607.593050319803},"kg"]
[null,null,null,null,null,null,{"$f":"Results!H83","v":517.34870023161648},null,{"$f":"Results!J31","v":77.940250308558106},"%"]
[null,null,null,{"$f":"Results!H68","v":2.7605470681699975},{"$f":"Results!I49","v":107.53094426551441},"kg",null,null,{"$f":"Results!F31*10^9","v":386.07593050319804},"ng/m³"]
[null,null,null,null,{"$f":"Results!J49","v":0.21708135757249392},"%",null,null,{"$f":"f_Air*10^6","v":5.2454054106768391},"µPa"]
[null,null,null,null,{"$f":"Results!G49*10^3","v":1.4934853370210335},"ng/g"]
[null,null,null,null,{"$f":"f_Veg*10^6","v":5.2177323294424331},"µPa"]
[null,null,null,null,null,null,{"$f":"Results!H80","v":2.8715771946001289E-2}]
[]
[]
[null,null,null,null,null,null,{"$f":"Results!H76","v":0.92141216322187991},null,{"$f":"Results!H75","v":7.2620969377649738},null,{"$f":"Results!H78","v":14.823027374916789}]
[null,"Water","Air"]
{"$rows_left_out":22}
{"sheet":"Chemical Database","index":7,"n_rows":38,"n_cols":53,"rows_kept":38,"cut":false,"hidden":false,"merged":[]}
[null,null,null,null,null,null,null,null,null,null,"",null,null,null,null,null,null,null,null,null,null,null,null,null,null,null,null,null,null,null,null,null,null,null,null,null,"Log Kow required for Type 1 chemicals. For Type 2 chemicals, relevant inputs are medium/water and for Type 3 chemicals relevant inputs are medium/air"]
[null,null,null,null,null,null,null,null,null,null,"",null,null,null,null,null,null,null,null,null,null,null,null,null,null,null,null,null,null,null,null,null,null,null,null,null,"Make sure to input proper partition ratios for Type 2 and Type 3 chemicals"]
[null,null,null,null,null,null,null,null,null,null,""]
[null,null,null,null,null,null,null,null,null,null,""]
[null,null,null,null,null,null,null,null,null,null,""]
[null,null,null,null,null,null,null,null,null,null,""]
[null,null,null,null,"Melting point, vapour pressure, solubility in water, and Henry's law constants required for Type 1 chemicals only",null,null,null,null,null,null,null,"Enthalpy (Required for Type 1 chemicals only)",null,null,null,"Half-Lives (If negligible, enter 1E+11)",null,null,null,null,null,null,null,null,null,"Activation Energy (Required for Type 1 chemicals only)",null,null,null,null,null,null,null,null,null,"Partition Ratios"]
["CAS","Chemical Name","Molar Mass","Data Temp.","Melting Point",null,"Vapor pressure",null,"Solubility in Water",null,"Henry's Law Constant",null,"Kow",null,"Kaw",null,"In Air",null,"In Water",null,"In Soil",null,"In Sediment",null,"In Vegetation",null,"In Air",null,"In Water",null,"In Soil",null,"In Sediment",null,"In Vegetation",null,"logKOW",null,"Air-Water/Water-Air",null,"Soil-Water/Soil-Air",null,"Susp. Particles-Water/Susp. Particles-Air",null,"Sediment-Water/Sediment-Air",null,"Fish-Water/Fish-Air",null,"Aerosol-Water/Aerosol-Air",null,"Vegetation-Water/Vegetation-Air",null,"NOTES"]
[null,null,"(g/mol)","°C","°C","Ref.","(Pa)","Ref.","(g/m³ or mg/L)","Ref.","(Pa·m³/mol)","Ref.","(kJ/mol)","Ref.","(kJ/mol)","Ref.","(hours)","Ref.","(hours)","Ref.","(hours)","Ref.","(hours)","Ref.","(hours)","Ref.","(kJ/mol)","Ref.","(kJ/mol)","Ref.","(kJ/mol)","Ref.","(kJ/mol)","Ref.","(kJ/mol)","Ref.",null,"Ref.","unitless (m³/m³)","Ref.","L/kg","Ref.","L/kg","Ref.","L/kg","Ref.","L/kg","Ref.","unitless","Ref.","L/kg","Ref."]
[null,"Specimen Type 1",250,25,275,null,0.02,null,30,null,{"$f":"IF(OR(B10=\"\",G10=\"\",B10=\"-\",G10=\"-\"),\"-\",G10*C10/I10)","v":0.16666666666666666},null,-20,null,55,null,17,null,55,null,170,null,170,null,8.5,null,10,null,30,null,30,null,30,null,10,null,2.5,null,null,null,null,null,null,null,null,null,null,null,null,null,null,null,"Example values for Type 1 chemicals such as benzene"]
[null,"Specimen Type 2",130,22,null,null,"-",null,null,null,{"$f":"IF(OR(B11=\"\",G11=\"\",B11=\"-\",G11=\"-\"),\"-\",G11*C11/I11)","v":"-"},null,null,null,null,null,100000000000,null,170,null,1700,null,17000,null,100000000000,null,null,null,null,null,null,null,null,null,null,null,null,null,0,null,450,null,0.7,null,30,null,800,null,200,null,250,null,"Example values for Type 2 chemicals such as alkylbenene sulfonates"]
[null,"Specimen Type 3",180,21,null,null,"-",null,null,null,"-",null,null,null,null,null,55,null,100000000000,null,550,null,100000000000,null,27,null,null,null,null,null,null,null,null,null,null,null,null,null,60,null,5000,null,8000,null,5300,null,9000,null,4000,null,3500,null,"Example values for Type 3 chemicals such as mineral oil"]
[null,"Benzene",78,25,5.35,null,12700,null,1780,null,556.51685393258424,null,-20,"EAS-E Suite",60,"EAS-E Suite",315.58,null,331.1,null,662.20500000000004,null,2979.92,null,null,null,10,null,30,null,30,null,30,null,10,null,2.13]
[null,"Toluene",92.13,25,-95,null,3800,null,515,null,679.79417475728155,null,-20,"EAS-E Suite",60,"EAS-E Suite",64.930000000000007,null,238.86500000000001,null,477.72500000000002,null,2149.75,null,null,null,10,null,30,null,30,null,30,null,10,null,2.69]
[null,"Chlorobenzene",112.56,25,-45.6,null,1580,null,484,null,367.44793388429758,null,-15,null,28.85,null,500.11,null,602.20000000000005,null,1204.4000000000001,null,5419.8,null,85,null,10,null,30,null,30,null,30,null,10,null,2.8]
[null,"1,4-Dichlorobenzene",147.01,25,53.1,null,130,null,83,null,230.25662650602408,null,-20,"EAS-E Suite",60,"EAS-E Suite",620.29999999999995,null,1239,null,2477.9,null,12390,null,null,null,10,null,30,null,30,null,30,null,10,null,3.4]
[null,"Hexachlorobenzene ",284.8,25,230,null,2.3E-3,null,5.0000000000000001E-3,null,131.00800000000001,null,-16.87,null,46.35,null,7351.7,null,14017,null,28033,null,140170,null,5800,null,10,null,30,null,30,null,30,null,10,null,5.47]
[null,"N-hexane",86.17,25,-95,null,20200,null,9.5,null,183224.63157894736,null,-20,"EAS-E Suite",60,"EAS-E Suite",74.05,null,152.80000000000001,null,305.59500000000003,null,1375.2,null,null,null,10,null,30,null,30,null,30,null,10,null,4.1100000000000003]
[null,"Tricholoroethylene",131.38999999999999,25,-73,null,9900,null,1100,null,1182.5099999999998,null,-20,"EAS-E Suite",60,"EAS-E Suite",191.85,null,1028.5999999999999,null,2057.1999999999998,null,9257.2000000000007,null,null,null,10,null,30,null,30,null,30,null,10,null,2.5299999999999998]
[null,"1-Pentanol",88.149000000000001,25,-78.2,null,300,null,22000,null,1.2020318181818181,null,-20,"EAS-E Suite",60,"EAS-E Suite",34.69,null,126.5,null,253,null,1138.5,null,null,null,10,null,30,null,30,null,30,null,10,null,1.5]
{"$rows_left_out":19}
{"sheet":"Environmental Database","index":8,"n_rows":11,"n_cols":55,"rows_kept":11,"cut":false,"hidden":false,"merged":[]}
[]
[]
[]
[]
[]
[]
[null,null,"Volume Fractions",null,null,null,null,null,null,null,"Area (m2)",null,null,null,"Area fraction (m2/m2)","Depth (m)",null,null,null,"Densities for subcompartments (kg/m³)",null,null,null,null,null,null,null,null,null,null,"Velocities (km/h)",null,"Organic Carbon (g/g)",null,null,"Lipid (g/g)",null,"Vegetation",null,"Transport Velocities (m/h)",null,null,null,null,null,null,null,null,null,null,null,null,"Scavenging Ratio"]
["Name","Environment Temperature (°C)","Aerosol in Air","Susp. Particles in Water","Fish in Water","Air in Soil","Water in Soil","Solids ins Soil","Water in Sediment","Solids in Sediment","Air","Water","Soil","Sediment","Vegetation","Air","Water","Soil","Sediment","Air in Air","Aerosol in Air","Water in Water","Susp. Particles in Water","Fish in Water","Air in Soil","Water in Soil","Solid in Soil","Water in Sediment","Solid in Sediment","Vegetation in soil","Wind","Water","Susp. Particles","Soil","Sediment","Fish","Vegetation","Biomass (kg/m2)","Leaf Area Index (m2/m2)","Air side air-water MTC","Water side air-water MTC","Rain rate","Aerosol dry deposition","Soil-air phase diffusion MTC","Soil-water phase diffusion MTC","Soil-air boundary layer MTC","Sediment-water diffusion MTC","Sediment deposition","Sediment resuspension","Soil-water runoff rate","Soil-solids runoff rate","Leaf-air boundary layer MTC","(unitless)","Fraction of rain intercepted by vegetation","NOTES"]
[]
["EQC- standard environment",20,1.9999999999999999E-11,5.0000000000000004E-6,9.9999999999999995E-7,0.2,0.3,0.5,0.8,0.2,100000000000,10000000000,90000000000,10000000000,0.8,1000,20,0.2,0.05,1.1850000000000001,2000,1000,1500,1000,1.1850000000000001,1000,2400,1000,2400,900,14.4,3.6,0.2,0.02,0.04,0.05,0.01,1,3,5,0.05,1E-4,10,0.02,1.0000000000000001E-5,5,1E-4,4.9999999999999998E-7,1.9999999999999999E-7,5.0000000000000002E-5,1E-8,9,200000,0.1]
["EQC- modified environment (no water)",20,1.9999999999999999E-11,5.0000000000000004E-6,9.9999999999999995E-7,0.2,0.3,0.5,0.8,0.2,100000000000,0,100000000000,0,0.8,1000,20,0.2,0.05,1.1850000000000001,2000,1000,1500,1000,1.1850000000000001,1000,2400,1000,2400,900,14.4,3.6,0.2,0.02,0.04,0.05,0.01,1,3,5,0.05,1E-4,10,0.02,1.0000000000000001E-5,5,1E-4,4.9999999999999998E-7,1.9999999999999999E-7,5.0000000000000002E-5,1E-8,9,200000,0.1]