{"text_format":"1","workbook":"xlsx","n_sheets":9,"sheets":["Instructions","Inputs - Chemical Properties","Inputs - Environment","Emissions and Inflows","Results","Diagram","Charts","Chemical Database","Environment Database"],"not_rendered":{"charts":3,"images":8,"macros":1,"external_links":3,"defined_names":182,"comments":2,"pivot_tables":0},"unopened":[],"bounds":{"document_bytes":16777216,"sheet_cells":100000,"rows_first":2000,"rows_last":500,"rows_between":2000,"halvings":0,"cell_chars":16384,"cell_head_chars":4096},"cells_cut":0,"cells_raw":0,"read":"whole","date_system":"1900"}

{"sheet":"Instructions","index":0,"n_rows":25,"n_cols":3,"rows_kept":25,"cut":false,"hidden":false,"merged":[[0,1,1,23],[7,2,7,23],[8,1,8,23],[10,1,10,23]]}
[null,"The Level II model uses different input properties depending on whether they are Type 1, Type 2, or Type 3 chemicals (as defined in Mackay et al. 1996). In this version of the model, the chemical 'Type' is selected based on certain chemical properties, rather than by user selection. Selection rules are as follows:"]
[]
[null,"Type 1 chemicals: Substances partition into air, water and octanol. These chemicals have measurable vapour pressures and solubilities. If a vapour pressure value is entered the chemical will be treated as Type 1."]
[null,null,"If the vapour pressure is not meaurable or negligible, enter a dash in vapour pressure cell, then continue to fill out the rest of the properties"]
[null,"Type 2 chemicals: The substance does not appreciably partition into air. If a dash is entered into vapour pressure then additional partition ratio inputs will appear for media/water systems"]
[null,"Type 3 chemicals: The substance does not appreciably partition into water. If a dash is entered in the vapour pressure input and the soil/water partition ratio value is 1000 or larger, then the required inputs will be media/air"]
[null,null,"If the inputted soil/water partition ratio > 1000, ALL partition ratio inputs will change to media/air from media/water. Some values may need to be re-inputted as media/air instead of media/water"]
[null,"Notes:","After the Inputs for your chemical is filled out in the Inputs sheet, it is recommended to add the chemical to the database by clicking the radial button 'Add to DB' to easily-re-enter the correct input data in the future\nThere are sample Type 1, 2, and 3 chemicals in the database"]
[null,"Continue filling out environment, emission and inflow inputs. Results are located in the 'Results' sheet and summarized in the 'Diagram' and 'Charts' sheets"]
[]
[null,"Property estimation guidelines (all equations from Mackay & Parnis 2021):"]
[null,"- Henry's law constant (H) an be estimated as: Vapor Pressure * Molar Mass / Solubility"]
[null,"- Reaction half-life estimated values can be obtained from EAS-E Suite (www.eas-e-suite.com), or EPI Suite for water & air half-lives only (https://www.epa.gov/tsca-screening-tools/epi-suitetm-estimation-program-interface)"]
[null,"- Koc can be estimated as Kow * 0.35 (Seth method) or as Kow * 0.41 (Karickhoff method)"]
[null,"- Kaw can be calculated as H/RT, where R = Gas constant and T = temperature"]
[null,"- Partition ratios can be calculated as the ratio of Z-values, e.g., Kaw = Za/Zw"]
[null,null,"> Za = 1/RT = 4x10^-4"]
[null,null,"> Zw = Za/Kaw"]
[null,null,"> Zo = Zw*Kow"]
[null,null,"> Z_solid = Zo * OC fraction; where any solid phase can be represented including sediment, suspended sediment, soil, etc. OC fraction default values can be found in the Environment properties sheet"]
[null,null,"> Z_biota = Zo * Lipid content; where any biota can be represented, including fish. Default lipid content values can be found in the Environment properties sheet"]
[]
[]
[null,"References:","Mackay et al. 1996. Assessing the fate of new and existing chemicals: a five-stage process. Environ. Toxicol Chem. 15(9), 1618-1626"]
[null,null,"Mackay & Parnis, 2021. Multimedia Environmental Models: The Fugacity Approach. 3rd ed. CRC Press, Taylor & Francis Group. Boca Raton, FL."]

{"sheet":"Inputs - Chemical Properties","index":1,"n_rows":36,"n_cols":6,"rows_kept":36,"cut":false,"hidden":false,"merged":[[8,5,9,5]]}
[]
[]
[null,null,"CHEMICAL PROPERTIES","Please complete all required fields below"]
[null,null,null,"or"]
[null,null,null,"Select a chemical from the database:"]
[null,null,"* indicates required input"]
[null,null,"Note: insert dash (-) if property is not inputted",null,null,"References and Notes"]
[]
[null,"*","Chemical Name","Benzo[a]pyrene"]
[null,null,"CAS"]
[]
[null,"*","Molar Mass (g/mol)",252.316]
[null,"*","Data Temperature (°C)",25]
[null,null,"Melting Point (°C)",175]
[null,null,"Vapor Pressure (Pa)",6.9999999999999997E-7]
[null,{"$f":"IF(Pressure=\"-\",\"\",\"*\")","v":"*"},"Henry's Law Constant (Pa·m³/mol)",4.6300000000000001E-2]
[]
[null,null,"Reaction Half-Lives (hours)"]
[null,"*","In Air",170,null,"EAS-E Suite Database"]
[null,"*","In Aerosol",170,null,"Assumption made that 1/2 life in air can be used"]
[null,"*","In Water",1700,null,"EAS-E Suite Database"]
[null,"*","In Suspended Particles",1700,null,"Assumption made that 1/2 life in sediment can be used"]
[null,"*","In Fish",26.77,null,"EAS-E Suite Database"]
[null,"*","In Soil",17000,null,"EAS-E Suite Database"]
[null,"*","In Sediment",55000,null,"EAS-E Suite Database"]
[]
[null,null,"Partition Ratios"]
[]
[null,{"$f":"IF(Pressure=\"-\",\"\",\"*\")","v":"*"},"logKOW",6.04]
[null,{"$f":"IF(Pressure=\"-\",\"\",\"*\")","v":"*"},"KOC",{"$f":"0.35*10^logKow","v":383767.36865011504},null,"Seth method"]
{"$rows_left_out":7}
{"sheet":"Inputs - Environment","index":2,"n_rows":27,"n_cols":7,"rows_kept":27,"cut":false,"hidden":false,"merged":[[20,5,23,6]]}
[]
[]
[null,null,"ENVIRONMENTAL PROPERTIES"]
[]
[null,null,"Please complete all fields or select an environment from the database:"]
[]
[null,null,"Environment Name","EQC-2012-Hughes et al."]
[]
[null,null,"Fractions",null,null,"Advective Flow Residence Times (h)"]
[null,null,"Aerosol in Air",1.9999999999999999E-11,null,"Air",100]
[null,null,"Susp. Particles in Water ",5.0000000000000004E-6,null,"Water",1000]
[null,null,"Fish in Water",9.9999999999999995E-7,null,"Sediment (burial)",50000]
[]
[null,null,"Volumes (m³)",null,null,"Organic Carbon (g/g)"]
[null,null,"Air",100000000000000,null,"Susp. Particles",0.2]
[null,null,"Water",200000000000,null,"Fish Lipid Fraction",0.05]
[null,null,"Soil",18000000000,null,"Soil",0.02]
[null,null,"Sediment",500000000,null,"Sediment",0.04]
[]
[null,null,"Density (kg/m³)",null,null,"Additional Comments "]
[null,null,"Air",1.2]
[null,null,"Aerosol",2000]
[null,null,"Water",1000]
[null,null,"Susp. Particles",1500]
[null,null,"Fish",1000]
[null,null,"Soil",2400]
[null,null,"Sediment",2400]

{"sheet":"Emissions and Inflows","index":3,"n_rows":12,"n_cols":11,"rows_kept":12,"cut":false,"hidden":false,"merged":[[12,2,13,6]]}
[]
[]
[]
[]
[null,null,"Emission Rate",100000,"kg/h",{"$f":"Emis_kgph*1000/MolarMass","v":396328.4135766261},"mol/h"]
[]
[null,null,"Advective Inflow Concentrations"]
[]
[null,null,"Concentration in Inflow Water",0,"ng/L",{"$f":"ConcWatNgpL/10^6/MolarMass","v":0},"mol/m³"]
[null,null,"Concentration in Air",0,"ng/m³",{"$f":"ConcAirNgpm3/10^9/MolarMass","v":0},"mol/m³"]
[null,null,null,null,null,null,null,null,null,null,0]
[null,null,"Additional Comments"]

{"sheet":"Results","index":4,"n_rows":73,"n_cols":11,"rows_kept":73,"cut":false,"hidden":false,"merged":[[62,3,62,4],[62,7,62,8],[18,3,18,4],[26,3,26,4],[18,5,18,8],[34,5,34,7],[34,8,34,10],[48,3,48,4],[26,6,26,7],[48,7,48,8]]}
[]
[]
[null,null,"Level II Results"]
[]
[null,null,"Chemical Name",{"$f":"ChemName","v":"Benzo[a]pyrene"}]
[null,null,"Environment Name",{"$f":"EnvName","v":"EQC-2012-Hughes et al."}]
[]
[]
[null,null,"Fugacity Ratio",{"$f":"IF(Pressure=\"-\",\"N/A\",IF(MeltPt>DataTemp,EXP(6.79*(1-(MeltPt+273.15)/(DataTemp+273.15))),1))","v":3.2841387705711961E-2}]
[]
[null,null,"Subcooled Liq. Vap. Press. (Pa)",{"$f":"IF(Pressure=\"-\",\"N/A\",Pressure/Fugacity_Ratio)","v":2.1314568259801397E-5}]
[]
[null,null,"Fugacity (Pa)",{"$f":"TotalChemInputM/(DAdvectTotal+DReactTotal)","v":1.2206649027869347E-6}]
[]
[null,null,"Aquivalence (mol/m3)",{"$f":"IF(AND(ISNUMBER(SEARCH(\"N/A\",Fugacity_Ratio)),KQW<1000),Conc_Water,IF(ISNUMBER(SEARCH(\"N/A\",Fugacity_Ratio)),\"-\",\"-\"))","v":"-"}]
[]
[null,null,"Mass Balance"]
[]
[null,null,null,"Rate",null,"Concentration"]
[null,null,null,"kg/h","mol/h","ng/m³","ng/L","kg/m³","mol/m³"]
[null,null,"Emission",{"$f":"Emis_kgph","v":100000},{"$f":"Emis_molph","v":396328.4135766261},"-","-","-","-"]
[null,null,"Inflow Air",{"$f":"E22*MolarMass/1000","v":0},{"$f":"F51*I22","v":0},{"$f":"ConcAirNgpm3","v":0},"-",{"$f":"F22*0.000000000001","v":0},{"$f":"F22*0.000000001/MolarMass","v":0}]
[null,null,"Inflow Water",{"$f":"E23*MolarMass/1000","v":0},{"$f":"F53*I23","v":0},"-",{"$f":"ConcWatNgpL","v":0},{"$f":"G23*0.000000001","v":0},{"$f":"G23*0.000001/MolarMass","v":0}]
[]
[null,null,"Total",{"$f":"E25*MolarMass/1000","v":100000},{"$f":"SUM(E21:E23)","v":396328.4135766261}]
[]
[null,null,null,"Loss rate",null,"D Value","Res. Time"]
[null,null,null,"kg/h","mol/h","m³/h","hours","days"]
[null,null,"Advection",{"$f":"H59","v":5443.6949441507131},{"$f":"I59","v":21574.909812103528},{"$f":"SUM(G51:G57)","v":17674719542.476593},{"$f":"I45/I59","v":428103.87444724928},{"$f":"G29/24","v":17837.661435302052}]
[null,null,"Reaction",{"$f":"H73","v":94556.305055849283},{"$f":"I73","v":374753.50376452255},{"$f":"SUM(G65:G71)","v":307007683197.0119},{"$f":"I45/I73","v":24646.340564210313},{"$f":"G30/24","v":1026.9308568420963}]
{"$rows_left_out":44}
{"sheet":"Diagram","index":5,"n_rows":42,"n_cols":17,"rows_kept":42,"cut":false,"hidden":false,"merged":[]}
[]
[null,null,null,"Chemical Name:",null,{"$f":"ChemName","v":"Benzo[a]pyrene"}]
[]
[null,null,null,"Lake Name:",null,{"$f":"EnvName","v":"EQC-2012-Hughes et al."}]
[]
[null,null,null,null,null,null,null,null,null,{"$f":"Results!J37","v":12424.31338343666},"kg",{"$f":"Results!H51","v":124.2431338343666},"kg/h"]
[null,null,null,null,null,null,null,null,null,{"$f":"Results!H37","v":"-"},"ng/m³",{"$f":"Results!J51","v":0.12424313383436661},"%"]
[{"$f":"IF(AND(ISNUMBER(SEARCH(\"N/A\",Results!$D$9)),'Inputs - Chemical Properties'!$D$33<1000),\"Aquivalence\",\"Fugacity\")","v":"Fugacity"},{"$f":"IF(AND(ISNUMBER(SEARCH(\"Aquivalence\",A8)),'Inputs - Chemical Properties'!$D$33<1000),Results!D15,Results!D13)","v":1.2206649027869347E-6},"Pa",null,null,null,{"$f":"Results!D22","v":0},"kg/h",null,{"$f":"Results!K37","v":5.3312550373337193E-4},"%"]
["Total Mass",{"$f":"Results!J45","v":2330466896.8998227},"kg"]
[null,{"$f":"Results!D25","v":100000},"kg/h"]
[null,null,null,null,null,null,null,null,null,null,null,null,{"$f":"Results!H65","v":50.658104659543028},"kg/h"]
[null,null,null,null,null,null,null,null,null,null,null,null,{"$f":"Results!J65","v":5.0658104659543041E-2},"%"]
[]
[]
[null,{"$f":"Results!G31","v":23304.66896899823},"h"]
[null,{"$f":"Results!G30","v":24646.340564210313},"h"]
[null,{"$f":"Results!G29","v":428103.87444724928},"h"]
[]
[]
[null,null,null,null,null,null,{"$f":"Results!J42","v":2205677660.536459},"kg",null,null,null,null,null,null,{"$f":"Results!H53","v":1330.4165773299117},"kg/h"]
[null,null,null,null,null,null,{"$f":"Results!H42","v":51057.35325315877},"ng/g",null,null,null,null,null,null,{"$f":"Results!J53","v":1.3304165773299119},"%"]
[null,null,null,null,null,null,{"$f":"Results!K42","v":94.645311781541764},"%",null,null,null,{"$f":"Results!J39","v":1330416.5773299115},"kg"]
[null,{"$f":"Emis_kgph","v":100000},"kg/h",null,null,null,null,null,null,null,null,{"$f":"Results!H39","v":"-"},"ng/L"]
[null,null,null,null,null,null,null,null,null,null,null,{"$f":"Results!K39","v":5.7087984347674717E-2},"%"]
[null,null,null,null,{"$f":"Results!H70","v":89932.897154406048},"kg/h",null,null,null,null,null,null,null,null,null,{"$f":"Results!H67","v":542.45558796849446},"kg/h"]
[null,null,null,null,{"$f":"Results!J70","v":89.932897154406049},"%",null,null,null,null,null,null,null,null,null,{"$f":"Results!J67","v":0.54245558796849447},"%"]
[]
[]
[null,null,null,null,null,null,null,null,null,{"$f":"Results!D23","v":0},"kg/h"]
[]
{"$rows_left_out":13}
{"sheet":"Charts","index":6,"n_rows":0,"n_cols":0,"rows_kept":0,"cut":false,"hidden":false,"merged":[]}

{"sheet":"Chemical Database","index":7,"n_rows":3080,"n_cols":43,"rows_kept":3080,"cut":false,"hidden":false,"merged":[]}
[]
[]
[]
[]
[]
[]
[null,null,null,null,null,null,null,null,null,null,null,null,"Half-Lives",null,null,null,null,null,null,null,null,null,null,null,null,null,"Partition Ratios"]
["CAS","Chemical Name","Molar Mass","Data Temp.","Melting Point",null,"Vapor pressure",null,"Solubility in Water",null,"Henry's Law Constant",null,"In Air",null,"In Aerosol",null,"In Water",null,"In Susp. Particles",null,"In Fish",null,"In Soil",null,"In Sediment",null,"logKOW",null,"KOC",null,"Air-Water (KAW)/Water-Air",null,"Aerosol-Water/Aerosol-Air",null,"Soil-Water/Soil-Air",null,"Suspended Particles-Water/Suspended Particles-Air",null,"Sediment-Water/Sediment-Air",null,"Fish-Water/Fish-Air",null,"NOTES"]
[null,null,"(g/mol)","°C","°C","Ref.","(Pa)","Ref.","(g/m³ or mg/L)","Ref.","(Pa·m³/mol)","Ref.","(hours)","Ref.","(hours)","Ref.","(hours)","Ref.","(hours)","Ref.","(hours)","Ref.","(hours)","Ref.","(hours)","Ref.",null,"Ref.","unitless","Ref.","unitless (m³/m³)","Ref.","unitless","Ref.","L/kg","Ref.","L/kg","Ref.","L/kg","Ref.","L/kg","Ref."]
[null,"Specimen Type 1",250,25,275,null,0.02,null,30,null,{"$f":"IF(OR(B10=\"\",G10=\"\",B10=\"-\",G10=\"-\"),\"\",G10*C10/I10)","v":0.16666666666666666},null,17,null,17,null,55,null,55,null,55,null,170,null,170,null,2.5,null,{"$f":"IF(OR(AA10=\"\",AA10=\"-\"),\"\",0.35*10^AA10)","v":110.67971810589339},{"$f":"IF(AC10=0.35*10^AA10,\"Seth method\",\"\")","v":"Seth method"},null,null,null,null,null,null,null,null,null,null,null,null,"Example values for type 1 chemicals such as  benzene"]
[null,"Specimen Type 2",252.3,25,"-",null,"-",null,"-",null,{"$f":"IF(OR(B11=\"\",G11=\"\",B11=\"-\",G11=\"-\"),\"\",G11*C11/I11)","v":""},null,17,null,170,null,55,null,170,null,170,null,170,null,170,null,null,null,{"$f":"IF(OR(AA11=\"\",AA11=\"-\"),\"\",0.35*10^AA11)","v":""},{"$f":"IF(AC11=0.35*10^AA11,\"Seth method\",\"\")","v":""},6.7199999999999994E-5,null,67.900000000000006,null,3.89,null,7.78,null,7.78,null,15.2,null,"Example values for type 2 chemical such as alkylbenzene sulfonates"]
[null,"Specimen Type 3",131.4,25,"-",null,"-",null,"-",null,"",null,17,null,17,null,55,null,55,null,55,null,170,null,170,null,null,null,"","",15000,null,1010000,null,58000,null,116000,null,116000,null,226000,null,"Example values for type 3 chemicals such as mineral oil"]
[null,"Benzene",78.11,25,5.53,null,12700,null,1780,null,557.30168539325848,null,315.58,"EAS-E Suite Database",315.58,"Assumption made that 1/2 life in air can be used",331.1,"EAS-E Suite Database",2979.92,"Assumption made that 1/2 life in sediment can be used",9.1999999999999993,"EAS-E Suite Database",662.20500000000004,"EAS-E Suite Database",2979.92,"EAS-E Suite Database",2.13,null,47.213700890707877,"Seth method"]
[null,"Toluene",92.13,25,-95,null,3800,null,515,null,679.79417475728155,null,64.930000000000007,"EAS-E Suite Database",64.930000000000007,"Assumption made that 1/2 life in air can be used",238.86500000000001,"EAS-E Suite Database",2149.75,"Assumption made that 1/2 life in sediment can be used",15.42,"EAS-E Suite Database",477.72500000000002,"EAS-E Suite Database",2149.75,"EAS-E Suite Database",2.69,null,171.42258677895617,"Seth method"]
[null,"Chlorobenzene",112.6,25,-45.6,null,1580,null,484,null,367.57851239669424,null,500.11,"EAS-E Suite Database",500.11,"Assumption made that 1/2 life in air can be used",602.20000000000005,"EAS-E Suite Database",5419.8,"Assumption made that 1/2 life in sediment can be used",2.2999999999999998,"EAS-E Suite Database",1204.4000000000001,"EAS-E Suite Database",5419.8,"EAS-E Suite Database",2.8,null,220.83507056806761,"Seth method"]
[null,"1,4-Dichlorobenzene",147.01,25,53.1,null,130,null,83,null,230.25662650602408,null,620.29999999999995,"EAS-E Suite Database",620.29999999999995,"Assumption made that 1/2 life in air can be used",1239,"EAS-E Suite Database",12390,"Assumption made that 1/2 life in sediment can be used",299.25,"EAS-E Suite Database",2477.9,"EAS-E Suite Database",12390,"EAS-E Suite Database",3.4,null,879.1602510283534,"Seth method"]
[null,"Hexachlorobenzene ",284.8,25,230,null,2.3E-3,null,5.0000000000000001E-3,null,131.00800000000001,null,7351.7,"EAS-E Suite Database",7351.7,"Assumption made that 1/2 life in air can be used",14017,"EAS-E Suite Database",140170,"Assumption made that 1/2 life in sediment can be used",6542.95,"EAS-E Suite Database",28033,"EAS-E Suite Database",140170,"EAS-E Suite Database",5.5,null,110679.71810589336,"Seth method"]
[null,"N-hexane",86.17,25,-95,null,20200,null,9.5,null,183224.63157894736,null,74.05,"EAS-E Suite Database",74.05,"Assumption made that 1/2 life in air can be used",152.80000000000001,"EAS-E Suite Database",1375.2,"Assumption made that 1/2 life in sediment can be used",8.7799999999999994,"EAS-E Suite Database",305.59500000000003,"EAS-E Suite Database",1375.2,"EAS-E Suite Database",4.1100000000000003,null,4508.8734309259753,"Seth method"]
[null,"Tricholoroethylene",131.38999999999999,25,-73,null,9900,null,1100,null,1182.5099999999998,null,191.85,"EAS-E Suite Database",191.85,"Assumption made that 1/2 life in air can be used",1028.5999999999999,"EAS-E Suite Database",9257.2000000000007,"Assumption made that 1/2 life in sediment can be used",9.35,"EAS-E Suite Database",2057.1999999999998,"EAS-E Suite Database",9257.2000000000007,"EAS-E Suite Database",2.5299999999999998,null,118.59545464872086,"Seth method"]
[null,"1-Pentanol",88.149000000000001,25,-78.2,null,300,null,22000,null,1.2020318181818181,null,34.69,"EAS-E Suite Database",34.69,"Assumption made that 1/2 life in air can be used",126.5,"EAS-E Suite Database",1138.5,"Assumption made that 1/2 life in sediment can be used",0.41,"EAS-E Suite Database",253,"EAS-E Suite Database",1138.5,"EAS-E Suite Database",1.5,null,11.067971810589331,"Seth method"]
[null,"Aniline",93.12,25,-6.3,null,65.19,null,36070,null,0.16829755475464375,null,3.42,"EAS-E Suite Database",3.42,"Assumption made that 1/2 life in air can be used",573.71,"EAS-E Suite Database",5163.3999999999996,"Assumption made that 1/2 life in sediment can be used",3.99,"EAS-E Suite Database",1147.4000000000001,"EAS-E Suite Database",5163.3999999999996,"EAS-E Suite Database",0.9,null,2.7801488215349859,"Seth method"]
[null,"Naphthalene",128.19,25,80.5,null,10.4,null,31,null,43.005677419354839,null,8.6300000000000008,"EAS-E Suite Database",8.6300000000000008,"Assumption made that 1/2 life in air can be used",414.99,"EAS-E Suite Database",1267.7,"Assumption made that 1/2 life in sediment can be used",61.81,"EAS-E Suite Database",829.99,"EAS-E Suite Database",1267.7,"EAS-E Suite Database",3.37,null,820.48008536197324,"Seth method"]
[null,"Phenanthrene",178.2,25,101,null,0.02,null,1.1000000000000001,null,3.2399999999999998,null,7.32,"EAS-E Suite Database",7.32,"Assumption made that 1/2 life in air can be used",618.245,"EAS-E Suite Database",3413.15,"Assumption made that 1/2 life in sediment can be used",119.13,"EAS-E Suite Database",1236.48,"EAS-E Suite Database",3413.15,"EAS-E Suite Database",4.57,null,13003.733018401072,"Seth method"]
[null,"Pyrene",202.3,25,156,null,5.9999999999999995E-4,null,0.13200000000000001,null,0.91954545454545455,null,3.97,"EAS-E Suite Database",3.97,"Assumption made that 1/2 life in air can be used",4988.75,"EAS-E Suite Database",64615,"Assumption made that 1/2 life in sediment can be used",50.01,"EAS-E Suite Database",9977.4,"EAS-E Suite Database",64615,"EAS-E Suite Database",5.18,null,52974.643695267288,"Seth method"]
[null,"PCB-15",223.1,25,149,null,4.7999999999999996E-3,null,0.06,null,17.847999999999999,null,192.54,"EAS-E Suite Database",192.54,"Assumption made that 1/2 life in air can be used",1758.4,"EAS-E Suite Database",15826,"Assumption made that 1/2 life in sediment can be used",567.66,"EAS-E Suite Database",3516.9,"EAS-E Suite Database",15826,"EAS-E Suite Database",5.3,null,69834.181023910845,"Seth method"]
[null,"PCB-52",292,25,87,null,4.8999999999999998E-3,null,0.03,null,47.693333333333328,null,527.4,"EAS-E Suite Database",527.4,"Assumption made that 1/2 life in air can be used",5914.2,"EAS-E Suite Database",53227,"Assumption made that 1/2 life in sediment can be used",1853.53,"EAS-E Suite Database",11828,"EAS-E Suite Database",53227,"EAS-E Suite Database",6.1,null,440623.89412795869,"Seth method"]
[null,"PCB-209",498.7,25,305.89999999999998,null,5.02E-8,null,1.0000000000000001E-5,null,2.5034739999999998,null,21193,"EAS-E Suite Database",21193,"Assumption made that 1/2 life in air can be used",81709,"EAS-E Suite Database",735380,"Assumption made that 1/2 life in sediment can be used",17534.52,"EAS-E Suite Database",163420,"EAS-E Suite Database",735380,"EAS-E Suite Database",8.26,null,63689530.051349603,"Seth method"]
[null,"Dibenzo-p-dioxin",184,25,123,null,5.5E-2,null,0.86499999999999999,null,11.699421965317919,null,32.090000000000003,"EAS-E Suite Database",32.090000000000003,"Assumption made that 1/2 life in air can be used",390.33,"EAS-E Suite Database",3513,"Assumption made that 1/2 life in sediment can be used",32.32,"EAS-E Suite Database",780.67,"EAS-E Suite Database",3513,"EAS-E Suite Database",4.3,null,6983.4181023910769,"Seth method"]
[null,"4-chlorophenol",128.56,25,43,null,20,null,27000,null,9.5229629629629622E-2,null,39.01,"EAS-E Suite Database",39.01,"Assumption made that 1/2 life in air can be used",597.61,"EAS-E Suite Database",5378.5,"Assumption made that 1/2 life in sediment can be used",9.25,"EAS-E Suite Database",1195.2,"EAS-E Suite Database",5378.5,"EAS-E Suite Database",2.4,null,87.91602510283532,"Seth method"]
[null,"Pentachlorophenol",266.33999999999997,25,190,null,4.15E-3,null,14,null,7.8950785714285709E-2,null,597.91,"EAS-E Suite Database",597.91,"Assumption made that 1/2 life in air can be used",6759.9,"EAS-E Suite Database",67599,"Assumption made that 1/2 life in sediment can be used",15,"EAS-E Suite Database",13520,"EAS-E Suite Database",67599,"EAS-E Suite Database",5.05,null,39270.645900568779,"Seth method"]
{"$rows_left_out":3051}
{"sheet":"Environment Database","index":8,"n_rows":15,"n_cols":23,"rows_kept":15,"cut":false,"hidden":false,"merged":[]}
[]
[]
[]
[]
[]
[]
[null,"Fractions",null,null,"Volumes ",null,null,null,"Advective Flow Residence Times ",null,null,"Density ",null,null,null,null,null,null,"Organic Carbon (g/g)"]
["Name","Aerosol in Air","Susp. Particles in Water","Fish in Water","Air","Water","Soil","Sediment","Air","Water","Sediment (burial)","Air","Aerosol","Water","Susp. Particles","Fish","Soil","Sediment","Susp. Particles","Fish Lipid","Soil","Sediment","NOTES"]
[null,null,null,null,"(m³)","(m³)","(m³)","(m³)","(h)","(h)","(h)","(kg/m³)","(kg/m³)","(kg/m³)","(kg/m³)","(kg/m³)","(kg/m³)","(kg/m³)","(g/g)","(g/g)","(g/g)","(g/g)"]
["Shield Lake",{"$f":"0.0000000001","v":1E-10},{"$f":"5*0.00001","v":5.0000000000000002E-5},{"$f":"0.0000001","v":9.9999999999999995E-8},100000000000000,100000000000,18000000000,100000000,100,20000,25000,1.1850000000000001,1500,1000,2000,1000,2400,2300,0.3,0.05,0.02,0.05]
["EQC Standard Region",null,null,null,100000000000000,200000000000,9000000000,100000000,100,1000,50000,1.1850000000000001,2000,1000,1500,1000,1500,1280,0.2,0.05,0.02,0.04]
["CEMC200105",null,null,null,100000000000000,1E+20,9000000000,100000000,100,1000,50000,1.1850000000000001,2000,1000,1500,1000,1500,1280,0.2,0.05,1.7073100000000001E-2,3.4146299999999997E-2]
["Default",null,null,null,100000000000000,200000000000,9000000000,100000000,100,1000,50000,1.1850000000000001,2000,1000,1500,1000,2400,2400,0.2,0.05,0.02,0.04]
["Hypothene",0,0,0,6000000000,7000000,45000,21000,600,7000,100000000000,1.175556,2000,1000,1500,1000,1500,1500,0.2,0.05,0.02,0.04]
["EQC-2012-Hughes et al.",1.9999999999999999E-11,5.0000000000000004E-6,9.9999999999999995E-7,100000000000000,200000000000,18000000000,500000000,100,1000,50000,1.2,2000,1000,1500,1000,2400,2400,0.2,0.05,0.02,0.04]